*Heading
** Job name: Rolling-www_3ds_ir Model name: rolling
** Generated by: Abaqus/CAE 6.14-2, www.3ds.ir
*Preprint, echo=NO, model=NO, history=NO, contact=NO
**
** PARTS
**
*Part, name=PART-1
*Node
*Element, type=CPE4R
*Elset, elset=METAL
** Section: Section-1-METAL
*Solid Section, elset=METAL, controls=EC-1, material=C15
1.,
*End Part
**
*Part, name=ROLLER
*End Part
**
**
** ASSEMBLY
**
*Assembly, name=Assembly
**
*Instance, name=ROLLER-1, part=ROLLER
*Node
*Nset, nset=ROLLER-1-RefPt_, internal
*Surface, type=SEGMENTS, name=ROLLER-1-ROLLER
START,       0.0409,        0.015
 CIRCL,      -0.1291,        0.185,       0.0409,        0.185
*End Instance
**
*Instance, name=PART-1-1, part=PART-1
*End Instance
**
*Elset, elset=BACK, instance=PART-1-1, generate
*Nset, nset=BAR, instance=PART-1-1
*Nset, nset=BOTTOM, instance=PART-1-1, generate
*Nset, nset=QA_TEST, instance=PART-1-1, generate
*Elset, elset=QA_TEST, instance=PART-1-1, generate
*Nset, nset=Set-9, instance=ROLLER-1
*Nset, nset=Set-10, instance=ROLLER-1
*Nset, nset=Set-11, instance=ROLLER-1
*Nset, nset=Set-12, instance=ROLLER-1
*Nset, nset=TOP, instance=PART-1-1, generate
*Elset, elset=TOP, instance=PART-1-1, generate
*Nset, nset=_Ref-Pt_ROLLER-1_10000, internal, instance=ROLLER-1
*Nset, nset=_M15, internal, instance=ROLLER-1
*Nset, nset=_M16, internal, instance=ROLLER-1
*Elset, elset=_SURF1_S2, internal, instance=PART-1-1, generate
*Surface, type=ELEMENT, name=SURF1
_SURF1_S2, S2
** Constraint: RigidBody-1
*Rigid Body, ref node=_Ref-Pt_ROLLER-1_10000, analytical surface=ROLLER-1.ROLLER-1-ROLLER
*End Assembly
**
** ELEMENT CONTROLS
**
*Section Controls, name=EC-1, hourglass=STIFFNESS
*Amplitude, name=Amp-1
             0.,              0.,           0.005,            0.05,            0.01,             0.1,           0.015,            0.15
           0.02,             0.2,           0.025,            0.25,            0.03,             0.3,           0.035,            0.35
           0.04,             0.4,           0.045,            0.45,            0.05,             0.5,           0.055,            0.55
           0.06,             0.6,           0.065,            0.65,            0.07,             0.7,           0.075,            0.75
           0.08,             0.8,           0.085,            0.85,        0.089286,              1.
**
** MATERIALS
**
*Material, name=C15
*Density
7850.,
*Elastic
 1.5e+11, 0.3
*Plastic
 1.6872e+08,  0.
 2.1933e+08, 0.1
 2.7202e+08, 0.2
 3.0853e+08, 0.3
 3.3737e+08, 0.4
 3.6158e+08, 0.5
 3.8265e+08, 0.6
 4.0142e+08, 0.7
**
** INTERACTION PROPERTIES
**
*Surface Interaction, name=FRICT-STEP-1
*Friction
 0.3,
**
** PREDEFINED FIELDS
**
** Name: IC-1   Type: Velocity
*Initial Conditions, type=VELOCITY
BAR, 1, 1.0367
BAR, 2, 0.
** ----------------------------------------------------------------
**
** STEP: Step-1
**
*Step, name=Step-1, nlgeom=YES
*Dynamic, Explicit
, 0.0535716
*Bulk Viscosity
**
** BOUNDARY CONDITIONS
**
** Name: Disp-BC-1 Type: Displacement/Rotation
*Boundary
BOTTOM, 2, 2
** Name: Disp-BC-2 Type: Displacement/Rotation
*Boundary
_M16, 1, 1
_M16, 2, 2
** Name: Vel-BC-1 Type: Velocity/Angular velocity
*Boundary, type=VELOCITY
_M15, 6, 6, 1.25664
**
** INTERACTIONS
**
** Interaction: FRICT-STEP-1-1
*Contact Pair, interaction=FRICT-STEP-1, mechanical constraint=KINEMATIC, cpset=FRICT-STEP-1-1
SURF1, ROLLER-1.ROLLER-1-ROLLER
**
** OUTPUT REQUESTS
**
*Restart, write, number interval=10, time marks=NO
**
** FIELD OUTPUT: F-Output-3
**
*Output, field, number interval=1, time marks=YES
*Element Output, directions=YES
PEEQ,
**
** FIELD OUTPUT: F-Output-4
**
*Node Output
U,
**
** FIELD OUTPUT: F-Output-1
**
*Element Output, elset=QA_TEST, directions=YES
PEEQ,
**
** FIELD OUTPUT: F-Output-2
**
*Node Output, nset=QA_TEST
U,
**
** HISTORY OUTPUT: H-Output-1
**
*Output, history, variable=PRESELECT, frequency=9999
*End Step
** ----------------------------------------------------------------
**
** STEP: Step-2
**
*Step, name=Step-2, nlgeom=YES
*Dynamic, Explicit
, 0.0535716
*Bulk Viscosity
**
** BOUNDARY CONDITIONS
**
** Name: Vel-BC-1 Type: Velocity/Angular velocity
*Boundary, type=VELOCITY
_M15, 6, 6, 1.25664
**
** OUTPUT REQUESTS
**
*Restart, write, number interval=1, time marks=NO
**
** FIELD OUTPUT: F-Output-3
**
*Output, field, number interval=1, time marks=YES
*Element Output, directions=YES
PEEQ,
**
** FIELD OUTPUT: F-Output-4
**
*Node Output
U,
**
** FIELD OUTPUT: F-Output-1
**
*Element Output, elset=QA_TEST, directions=YES
PEEQ,
**
** FIELD OUTPUT: F-Output-2
**
*Node Output, nset=QA_TEST
U,
**
** HISTORY OUTPUT: H-Output-1
**
*Output, history, variable=PRESELECT, frequency=9999
*End Step
** ----------------------------------------------------------------
**
** STEP: Step-3
**
*Step, name=Step-3, nlgeom=YES
*Dynamic, Explicit
, 0.0535716
*Bulk Viscosity
**
** BOUNDARY CONDITIONS
**
** Name: Vel-BC-1 Type: Velocity/Angular velocity
*Boundary, type=VELOCITY
_M15, 6, 6, 1.25664
**
** OUTPUT REQUESTS
**
*Restart, write, number interval=1, time marks=NO
**
** FIELD OUTPUT: F-Output-3
**
*Output, field, number interval=1, time marks=YES
*Element Output, directions=YES
PEEQ,
**
** FIELD OUTPUT: F-Output-4
**
*Node Output
U,
**
** FIELD OUTPUT: F-Output-1
**
*Element Output, elset=QA_TEST, directions=YES
PEEQ,
**
** FIELD OUTPUT: F-Output-2
**
*Node Output, nset=QA_TEST
U,
**
** HISTORY OUTPUT: H-Output-1
**
*Output, history, variable=PRESELECT, frequency=9999
*End Step
** ----------------------------------------------------------------
**
** STEP: Step-4
**
*Step, name=Step-4, nlgeom=YES
*Dynamic, Explicit
, 0.0535716
*Bulk Viscosity
**
** OUTPUT REQUESTS
**
*Restart, write, number interval=1, time marks=NO
**
** FIELD OUTPUT: F-Output-3
**
*Output, field, number interval=1, time marks=YES
*Element Output, directions=YES
PEEQ,
**
** FIELD OUTPUT: F-Output-4
**
*Node Output
U,
**
** FIELD OUTPUT: F-Output-1
**
*Element Output, elset=QA_TEST, directions=YES
PEEQ,
**
** FIELD OUTPUT: F-Output-2
**
*Node Output, nset=QA_TEST
U,
**
** HISTORY OUTPUT: H-Output-1
**
*Output, history, variable=PRESELECT, frequency=9999
*End Step
** ----------------------------------------------------------------
**
** STEP: Step-5
**
*Step, name=Step-5, nlgeom=YES
*Dynamic, Explicit
, 0.0535716
*Bulk Viscosity
**
** OUTPUT REQUESTS
**
*Restart, write, number interval=1, time marks=NO
**
** FIELD OUTPUT: F-Output-3
**
*Output, field, number interval=1, time marks=YES
*Element Output, directions=YES
PEEQ,
**
** FIELD OUTPUT: F-Output-4
**
*Node Output
U,
**
** FIELD OUTPUT: F-Output-1
**
*Element Output, elset=QA_TEST, directions=YES
PEEQ,
**
** FIELD OUTPUT: F-Output-2
**
*Node Output, nset=QA_TEST
U,
**
** HISTORY OUTPUT: H-Output-1
**
*Output, history, variable=PRESELECT, frequency=9999
*End Step
** ----------------------------------------------------------------
**
** STEP: Step-6
**
*Step, name=Step-6, nlgeom=YES
*Dynamic, Explicit
, 0.0535716
*Bulk Viscosity
**
** OUTPUT REQUESTS
**
*Restart, write, number interval=1, time marks=NO
**
** FIELD OUTPUT: F-Output-3
**
*Output, field, number interval=1, time marks=YES
*Element Output, directions=YES
PEEQ,
**
** FIELD OUTPUT: F-Output-4
**
*Node Output
U,
**
** FIELD OUTPUT: F-Output-1
**
*Element Output, elset=QA_TEST, directions=YES
PEEQ,
**
** FIELD OUTPUT: F-Output-2
**
*Node Output, nset=QA_TEST
U,
**
** HISTORY OUTPUT: H-Output-1
**
*Output, history, variable=PRESELECT, frequency=9999
*End Step
** ----------------------------------------------------------------
**
** STEP: Step-7
**
*Step, name=Step-7, nlgeom=YES
*Dynamic, Explicit
, 0.0535716
*Bulk Viscosity
**
** OUTPUT REQUESTS
**
*Restart, write, number interval=1, time marks=NO
**
** FIELD OUTPUT: F-Output-3
**
*Output, field, number interval=1, time marks=YES
*Element Output, directions=YES
PEEQ,
**
** FIELD OUTPUT: F-Output-4
**
*Node Output
U,
**
** FIELD OUTPUT: F-Output-1
**
*Element Output, elset=QA_TEST, directions=YES
PEEQ,
**
** FIELD OUTPUT: F-Output-2
**
*Node Output, nset=QA_TEST
U,
**
** HISTORY OUTPUT: H-Output-1
**
*Output, history, variable=PRESELECT, frequency=9999
*End Step
** ----------------------------------------------------------------
**
** STEP: Step-8
**
*Step, name=Step-8, nlgeom=YES
*Dynamic, Explicit
, 0.0535716
*Bulk Viscosity
**
** OUTPUT REQUESTS
**
*Restart, write, number interval=1, time marks=NO
**
** FIELD OUTPUT: F-Output-3
**
*Output, field, number interval=1, time marks=YES
*Element Output, directions=YES
PEEQ,
**
** FIELD OUTPUT: F-Output-4
**
*Node Output
U,
**
** FIELD OUTPUT: F-Output-1
**
*Element Output, elset=QA_TEST, directions=YES
PEEQ,
**
** FIELD OUTPUT: F-Output-2
**
*Node Output, nset=QA_TEST
U,
**
** HISTORY OUTPUT: H-Output-1
**
*Output, history, variable=PRESELECT, frequency=9999
*End Step
** ----------------------------------------------------------------
**
** STEP: Step-9
**
*Step, name=Step-9, nlgeom=YES
*Dynamic, Explicit
, 0.0535716
*Bulk Viscosity
**
** OUTPUT REQUESTS
**
*Restart, write, number interval=1, time marks=NO
**
** FIELD OUTPUT: F-Output-3
**
*Output, field, number interval=1, time marks=YES
*Element Output, directions=YES
PEEQ,
**
** FIELD OUTPUT: F-Output-4
**
*Node Output
U,
**
** FIELD OUTPUT: F-Output-1
**
*Element Output, elset=QA_TEST, directions=YES
PEEQ,
**
** FIELD OUTPUT: F-Output-2
**
*Node Output, nset=QA_TEST
U,
**
** HISTORY OUTPUT: H-Output-1
**
*Output, history, variable=PRESELECT, frequency=9999
*End Step