*Heading
** Job name: CEL-www_3ds_ir Model name: Model-1
** Generated by: Abaqus/CAE 6.14-2, www.3ds.ir
*Preprint, echo=NO, model=NO, history=NO, contact=NO
**
** PARTS
**
*Part, name=Eulerian
*Node
*Element, type=EC3D8R
*Nset, nset=Set-1, generate
*Elset, elset=Set-1, generate
** Section: Section-Eulerian
*Eulerian Section, elset=Set-1
polymer, polymer-1
*Surface, type=EULERIAN MATERIAL, name=polymer-1
polymer-1
*End Part
**
*Part, name=External
*Node
*Element, type=C3D8R
*Nset, nset=Set-1, generate
*Elset, elset=Set-1, generate
** Section: Section-steel
*Solid Section, elset=Set-1, material=Steel
*End Part
**
*Part, name=Internal
*Node
*Element, type=C3D8R
*Nset, nset=Set-1, generate
*Elset, elset=Set-1, generate
** Section: Section-steel
*Solid Section, elset=Set-1, material=Steel
*End Part
**
**
** ASSEMBLY
**
*Assembly, name=Assembly
**
*Instance, name=Eulerian-1, part=Eulerian
*End Instance
**
*Instance, name=External-1, part=External
*End Instance
**
*Instance, name=Internal-1, part=Internal
*End Instance
**
*Node
*Node
*Nset, nset=Set-5
*Nset, nset=Set-6
*Nset, nset=Set-7, instance=Eulerian-1
*Elset, elset=Set-7, instance=Eulerian-1
*Nset, nset=Set-8, instance=Eulerian-1
*Elset, elset=Set-8, instance=Eulerian-1
*Nset, nset=b_Set-1, instance=Internal-1, generate
*Elset, elset=b_Set-1, instance=Internal-1, generate
*Nset, nset=b_Set-3, instance=External-1, generate
*Elset, elset=b_Set-3, instance=External-1, generate
*Nset, nset=_PickedSet13, internal
*Nset, nset=_PickedSet15, internal
*Nset, nset=_PickedSet20, internal, instance=Eulerian-1, generate
*Elset, elset=_PickedSet20, internal, instance=Eulerian-1, generate
** Constraint: Constraint-1
*Rigid Body, ref node=_PickedSet13, elset=b_Set-1
** Constraint: Constraint-2
*Rigid Body, ref node=_PickedSet15, elset=b_Set-3
*End Assembly
*Amplitude, name=Amp-1
             0.,              0.,              1.,              1.
**
** MATERIALS
**
*Material, name=Steel
*Density
 0.00072,
*Elastic
 3.045e+07, 0.35
*Material, name=polymer
*Density
 0.0001345,
*Elastic
 30.5, 0.35
**
** INTERACTION PROPERTIES
**
*Surface Interaction, name=IntProp-1
*Friction
0.,
*Surface Behavior, pressure-overclosure=HARD
**
** BOUNDARY CONDITIONS
**
** Name: BC-1 Type: Symmetry/Antisymmetry/Encastre
*Boundary
Set-5, ENCASTRE
**
** PREDEFINED FIELDS
**
** Name: Predefined Field-1   Type: Material assignment
*Initial Conditions, type=VOLUME FRACTION
Eulerian-1.2095, Eulerian-1.polymer-1, 0.116821
Eulerian-1.2096, Eulerian-1.polymer-1, 0.208984
Eulerian-1.2097, Eulerian-1.polymer-1, 0.208984
Eulerian-1.2098, Eulerian-1.polymer-1, 0.208984
Eulerian-1.2099, Eulerian-1.polymer-1, 0.208984
Eulerian-1.2100, Eulerian-1.polymer-1, 0.208984
Eulerian-1.2101, Eulerian-1.polymer-1, 0.208984
Eulerian-1.2102, Eulerian-1.polymer-1, 0.208984
Eulerian-1.2103, Eulerian-1.polymer-1, 0.208984
Eulerian-1.2104, Eulerian-1.polymer-1, 0.208984
Eulerian-1.2105, Eulerian-1.polymer-1, 0.208984
Eulerian-1.2106, Eulerian-1.polymer-1, 0.208984
Eulerian-1.2107, Eulerian-1.polymer-1, 0.208984
Eulerian-1.2108, Eulerian-1.polymer-1, 0.208984
Eulerian-1.2109, Eulerian-1.polymer-1, 0.208984
Eulerian-1.2110, Eulerian-1.polymer-1, 0.208984
Eulerian-1.2111, Eulerian-1.polymer-1, 0.208984
Eulerian-1.2112, Eulerian-1.polymer-1, 0.208984
Eulerian-1.2113, Eulerian-1.polymer-1, 0.208984
Eulerian-1.2114, Eulerian-1.polymer-1, 0.208984
** ... 1300 like lines cut
**
** INTERACTIONS
**
** Interaction: Int-1
*Contact, op=NEW
*Contact Inclusions, ALL EXTERIOR
*Contact Property Assignment
 ,  , IntProp-1
** ----------------------------------------------------------------
**
** STEP: Step-1
**
*Step, name=Step-1, nlgeom=YES
*Dynamic, Explicit
, 2.
*Bulk Viscosity
**
** BOUNDARY CONDITIONS
**
** Name: BC-2 Type: Displacement/Rotation
*Boundary, amplitude=Amp-1
Set-6, 1, 1, 1.45
Set-6, 2, 2
Set-6, 3, 3
Set-6, 4, 4
Set-6, 5, 5
Set-6, 6, 6
** Name: BC-3 Type: Velocity/Angular velocity
*Boundary, type=VELOCITY
Set-7, 3, 3
** Name: BC-4 Type: Velocity/Angular velocity
*Boundary, type=VELOCITY
Set-8, 2, 2
**
** OUTPUT REQUESTS
**
*Restart, write, number interval=1, time marks=NO
**
** FIELD OUTPUT: F-Output-1
**
*Output, field, variable=PRESELECT, number interval=50
**
** HISTORY OUTPUT: H-Output-1
**
*Output, history, variable=PRESELECT
*End Step